statutory instrument number
type: Property
type: FunctionalProperty
type: DatatypeProperty
type: WebsiteLabelledThing
type: WebsiteDescribedThing
domain: StatutoryInstrumentPaper
range: integer
comment: Statutory instrument papers are given a number in the SI series which runs from number 1 each calendar year. SIs may be cited using prefix number and year e.g. SI 1986/935
website label: statutory instrument number
website description: Statutory instrument papers are given a number in the SI series which runs from number 1 each calendar year. SIs may be cited using prefix number and year e.g. SI 1986/935