statutory instrument paper made date
type: Property
type: FunctionalProperty
type: DatatypeProperty
type: WebsiteLabelledThing
type: WebsiteDescribedThing
domain: MadeStatutoryInstrumentPaper
range: date
comment: The date on which the statutory instrument was made. Note that the process of making happens outside Parliament, by the minister responsible for the statutory instrument.
website label: statutory instrument paper made date
website description: The date on which the statutory instrument was made. Note that the process of making happens outside Parliament, by the minister responsible for the statutory instrument.