formal body remit
type: Property
type: FunctionalProperty
type: DatatypeProperty
type: WebsiteLabelledThing
type: WebsiteDescribedThing
domain: FormalBody
range: string
comment: An atemporal description of the Formal Body's remit
website label: formal body remit
website description: An atemporal description of the Formal Body's remit