Work packaged thing
type: Class
type: WebsiteLabelledThing
type: WebsiteDescribedThing
subclass of: Resource
comment: Any thing which can be the focus of a Work Package - for example statutory instrument papers.
website label: Work packaged thing
website description: Any thing which can be the focus of a Work Package - for example statutory instrument papers.