Image subject
type: Class
type: WebsiteLabelledThing
type: WebsiteDescribedThing
subclass of: Resource
comment: The person or thing an image is of, which is depicted in the Image
website label: Image subject
website description: The person or thing an image is of, which is depicted in the Image