Focus period
type: Class
type: WebsiteLabelledThing
type: WebsiteDescribedThing
subclass of: Resource
comment: The period during which a thing is focussed upon
website label: Focus period
website description: The period during which a thing is focussed upon